{"text_format":"1","workbook":"xlsx","n_sheets":15,"sheets":["Army List","List","Change log","Ver","Traits","Characteristics","General Characteristics","Spells","Data2","Config_old","Data","Characteristics_old","General Characteristics_old","Spells_old","Traits_old"],"not_rendered":{"charts":0,"images":5,"macros":1,"external_links":0,"defined_names":9,"comments":0,"pivot_tables":0},"unopened":[],"bounds":{"document_bytes":16777216,"sheet_cells":100000,"rows_first":2000,"rows_last":500,"rows_between":2000,"halvings":0,"cell_chars":16384,"cell_head_chars":4096},"cells_cut":0,"cells_raw":0,"read":"whole","date_system":"1900"}

{"sheet":"Army List","index":0,"n_rows":83,"n_cols":17,"rows_kept":83,"cut":false,"hidden":false,"merged":[[17,2,17,16],[18,2,18,16],[19,2,19,16],[22,1,22,16],[4,2,4,16],[6,1,6,16],[7,2,7,16],[10,2,10,16],[15,2,15,16],[16,2,16,16],[13,2,13,16],[11,2,11,16],[12,2,12,16],[3,1,3,16],[9,1,9,16],[32,11,32,13],[34,8,34,9],[34,11,34,13],[32,14,32,16],[31,14,31,16],[33,14,33,15],[34,14,34,15],[23,2,23,15],[31,10,32,10],[31,11,31,13],[24,2,24,15],[25,2,25,15],[26,2,26,15],[14,2,14,16],[84,1,84,16],[83,1,83,16],[46,1,46,3],[81,1,81,14],[72,7,72,9],[75,7,75,9],[59,7,59,9],[64,7,64,9],[67,7,67,9],[46,4,46,13],[47,7,47,9],[31,1,33,5],[56,7,56,9],[50,7,50,9],[33,11,33,13],[37,7,37,9],[40,7,40,9]]}
[]
[]
[]
[null,"Army Trait"]
[null,"-",{"$f":"VLOOKUP(B5,Traits!A2:C24,3,FALSE)","v":"-"}]
[]
[null,"General Characteristics"]
[null,"-",{"$f":"VLOOKUP(B8,'General Characteristics'!B2:G33,6,FALSE)","v":"-"}]
[]
[null,"Army Characteristics"]
{"$rows_left_out":74}
{"sheet":"List","index":1,"n_rows":54,"n_cols":48,"rows_kept":54,"cut":false,"hidden":true,"merged":[[8,46,8,47],[5,33,5,36],[55,2,55,40],[52,2,52,38],[53,37,53,38],[54,2,54,40],[30,14,30,25],[30,34,30,36],[38,14,38,25],[38,34,38,36],[46,14,46,25],[46,34,46,36],[51,34,51,36],[35,14,35,25],[35,34,35,36],[43,14,43,25],[2,8,3,8],[3,37,4,38],[27,14,27,25],[27,34,27,36],[17,2,17,5],[8,14,8,25],[8,34,8,36],[18,14,18,25],[18,34,18,36],[17,6,17,36],[43,34,43,36],[9,44,17,44],[11,14,11,25],[11,34,11,36],[2,33,2,36],[2,39,2,40],[3,44,6,44],[6,34,6,36],[3,39,3,40],[3,33,3,36],[4,33,4,36],[21,14,21,25],[21,34,21,36],[2,29,3,29],[4,24,5,24],[4,19,5,19],[52,44,54,44],[47,44,50,44],[39,44,42,44],[31,44,34,44],[22,44,26,44]]}
[]
[]
[null,null,null,null,null,null,null,null,null,null,null,"trait",{"$f":"'Army List'!B5","v":"-"},{"$f":"VLOOKUP(M3,Traits!A2:B23,2,FALSE)","v":0},null,null,null,null,null,"Minor Heroes","HERO COST",null,null,null,"Camps","CAMP COST","CAMP VP",null,null,null,null,null,null,"Victory Medals",null,null,null,null,null,"Total  Points",null,null,null,null,null,null,"CORE Calc"]
[null,null,null,null,null,null,null,null,null,null,null,null,null,null,null,null,null,null,null,{"$f":"'Army List'!I33","v":2},{"$f":"T4*10","v":20},null,null,null,{"$f":"'Army List'!J33","v":1},{"$f":"Y4*10","v":10},{"$f":"Y4*3","v":3},null,null,null,null,null,null,{"$f":"ROUND(AN53/3,0)","v":1},null,null,null,"Victory Medals",null,{"$f":"SUM(AO10:AO43)+U4+Z4+N3","v":30},null,null,null,null,"Command demoralisation VP losses",null,{"$f":"SUM(List!D11:D51)","v":1}]
[null,null,null,null,null,null,null,null,null,null,null,null,null,null,null,null,null,null,null,null,null,null,null,null,null,null,null,null,null,null,null,null,null,"Scouting",null,null,null,null,null,"Core","Non-Core",null,null,null,null,null,"Non Core"]
[null,null,null,null,null,{"$f":"List!AU9","v":""},null,null,null,null,null,null,null,null,null,"Points","Save","VP","VM",null,"Points","Save","VP  ","VM",null,"Points","Save","VP","VM",null,null,null,null,{"$f":"ROUNDDOWN(AR52,0)","v":0},null,null,null,null,null,{"$f":"List!AU4","v":1},{"$f":"List!AU6","v":0},null,null,null,null,null,{"$f":" IF(List!F10<>\"Monstrous general\",List!G11,0)\n+IF(List!F20<>\"Monstrous general\",List!G21,0)\n+IF(List!F29<>\"Monstrous general\",List!G30,0)\n+IF(List!F37<>\"Monstrous general\",List!G38,0)\n+IF(List!F45<>\"Monstrous general\",List!G46,0)\n+SUM(List!G13:G17)\n+SUM(List!G23:G27)\n+SUM(List!G32:G35)\n+SUM(List!G40:G43)\n+SUM(List!G48:G51)\n-AU4","v":0}]
[null,null,"Unit name",null,null,"Unit type",null,"Size",null,"Cost","Concatenate","Qual cost","Detached?","detach cost","Char 1","Cost Adj 1","Save Adj 1","VP Adj 1",null,"Char 2","Cost Adj 2","Save Adj 2","VP Adj 2",null,"Char 3","Cost Adj 3","Save Adj 2","VP Adj 2",null,null,"Permitted?","R-S cost",null,null,"Save",null,null,"VP","Cost","Total VP","Total pts",null,null,null,null,null,{"$f":"IF(AU6>AU4,\"Error\",\"\")","v":""},"ratio number"]
[null,null,null,null,null,null,null,null,null,null,null,null,null,null,null,null,null,null,null,null,null,null,null,null,null,null,null,null,null,null,null,null,null,null,null,null,null,null,null,null,null,null,null,null,null,null,"Validation ",{"$f":"IF(AU7<>\"Error\",IF(AU4+AU6=0,\"\",ROUNDDOWN((AU6/AU4)*10,0)),10)","v":0}]
[null,null,"Leader",null,null,"Unit type",null,"Size","Quality","Cost","Concatenate","Qual cost","Detached?","detach cost","Characteristics",null,null,null,null,null,null,null,null,null,null,null,null,null,null,null,null,null,"VM","Hits","Save",null,null,"VP","Cost","VP","Total pts",null,null,null,null,null,{"$f":"IF(AU4+AU6=0,\"\",IF((AV8>6),\"Error - Not enough Core choices\",\"\"))","v":""}]
[null,null,"C-in-C",null,null,{"$f":"'Army List'!D39","v":"None"},{"$f":"IF(F10=\"None\",0,1)","v":0},null,null,null,null,null,{"$f":"'Army List'!G39","v":"✕"},{"$f":"IF(M10=\"✓\",10,0)","v":0},{"$f":"'Army List'!H39","v":"-"},{"$f":"VLOOKUP(O10,Data!B36:E53,4,FALSE)","v":0},{"$f":"VLOOKUP(O10,Data!B36:E53,2,FALSE)","v":0},{"$f":"VLOOKUP(O10,Data!B36:F44,3,FALSE)","v":0},{"$f":"VLOOKUP(O10,Data!B36:F44,5,FALSE)","v":0},{"$f":"'Army List'!I39","v":"-"},{"$f":"VLOOKUP(T10,Data!B36:E53,4,FALSE)","v":0},{"$f":"VLOOKUP(T10,Data!B36:E53,2,FALSE)","v":0},{"$f":"VLOOKUP(T10,Data!B36:E53,3,FALSE)","v":0},{"$f":"VLOOKUP(T10,Data!B36:F44,5,FALSE)","v":0},{"$f":"'Army List'!J39","v":"-"},{"$f":"VLOOKUP(Y10,Data!B36:E53,4,FALSE)","v":0},{"$f":"VLOOKUP(Y10,Data!B36:E53,2,FALSE)","v":0},{"$f":"VLOOKUP(Y10,Data!B36:E53,3,FALSE)","v":0},{"$f":"VLOOKUP(Y10,Data!B36:F44,5,FALSE)","v":0},null,null,null,{"$f":" VLOOKUP($F10,Data!B30:F33,5,FALSE) +S10+X10+AC10","v":0},null,null,{"$f":"VLOOKUP($F10,Data!$B$30:$E$33,2,FALSE)+Q10+V10+AA10","v":0},"+",{"$f":"VLOOKUP($F10,Data!$B$30:$E$33,3,FALSE)+R10+W10+AB10","v":0},{"$f":"VLOOKUP($F10,Data!$B$30:$E$33,4,FALSE)+N10+P10+U10+Z10","v":0},{"$f":"G10*AL10","v":0},{"$f":"G10*AM10","v":0},null,{"$f":"IF(O10=\"Brilliant\",1,0) + IF(T10=\"Brilliant\",1,0) + IF(Y10=\"Brilliant\",1,0)","v":0},{"$f":"G10*AQ10","v":0},{"$f":"ROUND(SUM(AN10:AN18)/2,0)","v":0}]
{"$rows_left_out":45}
{"sheet":"Change log","index":2,"n_rows":79,"n_cols":1,"rows_kept":79,"cut":false,"hidden":true,"merged":[]}
[]
["fixes bugs added in 5.7 :-("]
[5.8]
["Comarty additions "]
[5.7]
[]
["Chaos Daemns change"]
["5.4"]
["Ogre Kinggdom VP change "]
["5.3"]
{"$rows_left_out":70}
{"sheet":"Ver","index":3,"n_rows":3,"n_cols":2,"rows_kept":3,"cut":false,"hidden":true,"merged":[]}
["Column1","Column2"]
["version","date"]
["v6.2","23/03/2022 14:40:34"]

{"sheet":"Traits","index":4,"n_rows":23,"n_cols":3,"rows_kept":23,"cut":false,"hidden":true,"merged":[]}
["Trait ","Cost","Effect"]
["-",0,"-"]
["All is Dust",-100,"When a Wizard is slain all  units in and adjacent to the Wizards box take 1 hit, as if from melee. Saves can be made."]
["Ambuscade",50,"Before deployment select up to 3 non-monstrous creature units to be placed into ambush. Attached Generals can be included in this ambush. These units are deployed off-table. Starting from the Player’s 2nd turn you may try to deploy any off-table troops from ambush. Draw an activation card. Attached generals can redraw.\n\n1      The units is lost (counting destroyed), but does not surrender any victory medals\n2-4   The unit is not deployed, remaining off table\n5-8   Deploy the unit in a terrain box (not adjacent to enemy),or out of sight of all enemy \n9-10 Deploy the unit in any terrain box, or out of sight of all enemy"]
["Ancient Race",-70,"The  army must surrender 1 victory medal before the battle begins."]
["Backbone of the Mountain",50,"Before the first piece of terrain is placed the player must choose 1 of the following - \n\n1 - Place 1 box of impassible terrain before any other terrain is placed.\n2 - As the passive army their camps count as fortified (around each face of the box)"]
["City Walls",75,"As the passive army camps can be replaced by City Walls. These count as fortified camps (around the perimeter of boxes). All camps must be placed in contiguous boxes when this option is chosen. Units garrisoning the City walls have no flanks and any attack against the box will count as a frontal attack. If City Walls are chosen then at least 2 camps must be taken in the list\n\nAs the active army place 1 box of impassible terrain directly before the passive army deploys its first command. While this is a terrain piece, for the purposes of enemy troop movement the counts as a unit. This means enemy cannot march while nearby"]
["General Muster",-100,"Each command must have at least two units of a compulsory core troop type."]
["Incursion",50,"This army can choose to field 0 camps "]
["Jungle Runners",75,"No command penalty is applied to any units in the army on account of dense terrain. "]
{"$rows_left_out":14}
{"sheet":"Characteristics","index":5,"n_rows":75,"n_cols":7,"rows_kept":75,"cut":false,"hidden":true,"merged":[]}
["Group","Characterics","Cost","Save","VP","VM","Effect"]
["-","-",0,0,0,0,"-"]
["A","Army Standard (I)",20,0,1,1,"As per TtS! Rules"]
["A","Army Standard (II)",30,0,2,2,"As per TtS! Rules"]
["A","Army Standard (III)",40,0,3,3,"As per TtS! Rules"]
["A","Anti-Magic Aura ",70,0,0,0,"When an enemy wizard casts a spell within 3 boxes of troops with his characteristic, it can attempt to unbind the enemy magic. Draw a single card, if this card is higher than the total casting cost the spell is dispelled."]
["A","Animosity ",-10,0,0,0,"When activating troops with this characteristic, and a 1-PIP card is drawn one unit in the activation takes a hit.\nIf a generals re-draw is then used no saves are allowed, otherwise a save can be made"]
["A","Aquatic",5,0,0,0,"Troops with this characteristic can treat impassible water features as rough terrain. They also treat marsh and water \nfeatures as cover"]
["B","Black Powder",10,0,0,0,"Shooting hits made by troops with Black Powder characteristic have a +1 to Save modifier. This can stack with other modifiers"]
["B","Breath Weapon",15,0,0,0,"Monstrous Creatures with this characteristic can shoot into their front facing box. No ammunition is tracked, or expended. They are limited to 1 breath weapon attack per turn. \nBreath Weapons hit on a 6+, with a negative modifier to the enemy save equal to the Monstrous Creatures level."]
{"$rows_left_out":66}
{"sheet":"General Characteristics","index":6,"n_rows":10,"n_cols":7,"rows_kept":10,"cut":false,"hidden":true,"merged":[]}
["Group","Characterics","Cost","Save","VP","VM","Effect"]
[null,"-",0,0,0,0,"-"]
["C","College of Magic",15,0,0,0,"Wizards casting a spell add +1 to their casting draw for each other Wizard, with the College of Magic\ncharacteristic, in the army. The maximum this can be modified by is equal to the casting Wizards level."]
["C","Clan",-100,0,0,0,"Clan Generals must belong to a Clan specified by the army list. Each Clan command can only have troops of the same Clan. Each Clan command must have at least 1 unit of core troops. Each unit is  from a specific Clan. If no Clan is specified they can be from any. An army can contact commands of different Clans."]
["D","Daemonic",5,0,0,0,"Wizards with the Daemonic characteristic do not add their level to a miscast result. For miscast results of 3 PIP or less, they are still destroyed, but a Spawn of Chaos Spawn is placed in the Wizard's box (if there is space). The Spawn of Chaos is in the same command . The Spawn of Chaos inherits any activation and effect tokens from the Wizard. If no Spawn of Chaos model is available, or the unit cannot fit in the box, the Wizard is simply destroyed."]
["E","Enchantress",30,0,2,0,"The Enchantress draws 2 cards when casting a spell, discarding the lowest. She also adds 2 VP to the army"]
["L","Long Reach",100,0,0,0,"A Wizard with this characteristic is not present on the battlefield. He cannot command any troops, and cannot be targetted in any way. When casting any spell however,  you can treat any box as the casting location."]
["M","Master of Magic",30,-1,3,0,"A Wizard with this characteristic have the following - \n- Draws a single card when dispelling \n- All friendly wizards within 3 boxes add 1 to the casting draw total, including the Master of Magic himself\n- +1 to Save "]
["R","Rune Priest",80,0,0,0,"Picking this trait means you cast no Magic. However they can field a Rune Priest (counting as a Level 2 Wizard). A Rune Priest cannot cast any spells but is skilled at unbinding enemy magic. When a Rune Priest attempts to dispel they can discard the lowest card rather than the highest"]
[null,"-",0,0,0,0,"-"]
{"$rows_left_out":1}
{"sheet":"Spells","index":7,"n_rows":56,"n_cols":3,"rows_kept":56,"cut":false,"hidden":true,"merged":[]}
["Column1","Column2","Column3"]
["Spell","Casting Value ","Effect "]
["-","-","-"]
["Aerial Shield","6","When the spell is successfully place an Aerial Shield token in the Wizards box.\nAerial Shield token - All friendly units in the same or adjacent square to the Aerial Shield token can draw an extra save card after being shot at, discarding one. "]
["Anger of the Gods","6","When cast place an Anger of the Gods token in the Wizards square. Casting this spell ends the Wizard’s activation \n(but not the command). Anger of the Gods token - All enemy units within 3 boxes have Command (+2)"]
["Apotheosis","8","This spell can be cast on a friendly unit within 3 boxes. The Wizard must be able to see his target to use this spell. \nApotheosis removes a single disruption marker from the unit."]
["Arcane Fire","6","This spell is cast upon a missile-armed friendly unit, within 3 boxes of the Wizard. The Wizard does not need to be able to see the friendly unit nor their intended target. Arcane Fire cannot be cast on Artillery. \nWhen Arcane Fire is cast the target unit shoots immediately, without activation. This spell can be cast on a unit even if it has already activated. Ammunition is expended as normal for the shots fired."]
["Arcane Spite","6","If cast successfully place an Arcane Spite token in the Wizards box. This marker has an adverse effects on your enemy. \nArcane Spite token  - enemy troops in a box adjacent box suffer with the following - Save (+1) & Command (+1) "]
["Arcane Vigour","7","Pick a visible box within 4 boxes of the casting Wizard. The spell affects all units within that box. Units in the box can \nbe moved as if they had received a successful activation, even if they have already been activated previously."]
["Ball of Flame","7","When cast successfully, starting from the Wizards box pick a face -\n- Make 3 shooting attacks into a box contiguous to the selected face\n- Make 2 shooting attacks in the 2nd box from the selected face\n- Make 1 shooting attack in the 3rd box from the selected face\nThe route of the ball of flame is in a 3 box line. \nNormal saves may be made from these attacks"]
{"$rows_left_out":47}
{"sheet":"Data2","index":8,"n_rows":115,"n_cols":27,"rows_kept":115,"cut":false,"hidden":true,"merged":[]}
["Column1","Column2","Column3","Column4","Column5","Column6","Column7","Column8","Column9","Column10","Column11","Column12","Column13","Column14","Column15","Column16","Column17","Column18","Column19","Column20","Column21","Column22","Column23","Column24","Column25","Column26","Column27"]
[]
[]
[]
[null,"Generals","Save","VP","Cost","VM",null,"Troops","Size","Save","VP","Cost","Hits","VM","Scouting",null,"Quality",null,null,null,null,"Army","Name ","Cost","Save","VP","VM"]
[null,"None",0,0,0,0,null,"None","Std",0,0,0,0,0,0,null,"Regular",null,null,null,null,"Pick an Army!.1","PICK AN ARMY!",0,0,0,0]
[null,"Attached general on foot","2+",2,50,2,null,"Artillery (Bolt Shooter) - mobile","Std",7,1,65,1,1,-1,null,"Veteran",null,null,null,null,"Pick an Army!.2","PICK AN ARMY!",0,0,0,0]
[null,"Attached mounted general","2+",2,60,2,null,"Artillery (Organ Gun)","Std",7,1,70,1,1,-1,null,"Raw",null,null,null,null,"Pick an Army!.3","PICK AN ARMY!",0,0,0,0]
[null,"Detached general on foot","2+",2,60,2,null,"Artillery (Catapult) ","Std",7,1,60,1,1,-1,null,null,null,null,null,null,"ARABY.1","Magic Carpet Ride",5,0,0,0]
[null,"Detached mounted general","2+",2,70,2,null,"Artillery (Cannon)","Std",7,1,70,1,1,-1,null,"Concatenated quality",null,null,null,null,"ARABY.2","The Sultan's Guards",5,0,0,0]
{"$rows_left_out":106}
{"sheet":"Config_old","index":9,"n_rows":8,"n_cols":2,"rows_kept":8,"cut":false,"hidden":true,"merged":[]}
["Version","v.6.0"]
["Date","2021-03-09T10:42:29.930"]
["Now",{"$f":"NOW()","v":"2022-03-23T14:41:11.620"}]
[]
["Characteristics",{"$f":"COUNTA('Characteristics'!A2:A71)+1","v":71}]
["General Characteristics",{"$f":"COUNTA('General Characteristics'!A2:A7)+1","v":6}]
["Spells",{"$f":"COUNTA(Spells!A2:A15)+1","v":15}]
["Traits",{"$f":"COUNTA(Traits!A2:A23)+1","v":23}]

{"sheet":"Data","index":10,"n_rows":114,"n_cols":27,"rows_kept":114,"cut":false,"hidden":true,"merged":[[57,16,57,17]]}
[]
[]
[]
[null,"Generals","Save","VP","Cost","VM",null,"Troops","Size","Save","VP","Cost","Hits","VM","Scouting",null,"Quality",null,null,null,null,"Army","Name ","Cost","Save","VP","VM"]
[null,"None",0,0,0,0,null,"None","Std",0,0,0,0,0,0,null,"Regular",null,null,null,null,"Pick an Army!.1","PICK AN ARMY!",0,0,0,0]
[null,"Attached general on foot","2+",2,50,2,null,"Artillery (Bolt Shooter) - mobile","Std",7,1,65,1,1,-1,null,"Veteran",null,null,null,null,"Pick an Army!.2","PICK AN ARMY!",0,0,0,0]
[null,"Attached mounted general","2+",2,60,2,null,"Artillery (Organ Gun)","Std",7,1,70,1,1,-1,null,"Raw",null,null,null,null,"Pick an Army!.3","PICK AN ARMY!",0,0,0,0]
[null,"Detached general on foot","2+",2,60,2,null,"Artillery (Catapult) ","Std",7,1,60,1,1,-1,null,null,null,null,null,null,"ARABY.1","Magic Carpet Ride",5,0,0,0]
[null,"Detached mounted general","2+",2,70,2,null,"Artillery (Cannon)","Std",7,1,70,1,1,-1,null,"Concatenated quality",null,null,null,null,"ARABY.2","The Sultan's Guards",5,0,0,0]
[null,"Attached general on foot, heroic","3+",2,60,2,null,"Artillery (Field gun)","Std",7,1,80,1,1,-1,null,"DeepRegular",0,null,null,null,"ARABY.3","Sons of the Desert",5,0,0,0]
{"$rows_left_out":105}
{"sheet":"Characteristics_old","index":11,"n_rows":71,"n_cols":7,"rows_kept":71,"cut":false,"hidden":true,"merged":[]}
["Group","Characterics","Cost","Save","VP","VM","Effect"]
["-","-",0,0,0,0,"-"]
["A","Army Standard (I)",20,0,1,1,"As per TtS! Rules"]
["A","Army Standard (II)",30,0,2,2,"As per TtS! Rules"]
["A","Army Standard (III)",40,0,3,3,"As per TtS! Rules"]
["A","Anti-Magic Aura ",70,0,0,0,"When an enemy wizard casts a spell within 3 boxes of troops with his characteristic, it can attempt to unbind the enemy magic. Draw a single card, if this card is higher than the total casting cost the spell is dispelled."]
["A","Animosity ",-10,0,0,0,"When activating troops with this characteristic, and a 1-PIP card is drawn one unit in the activation takes a hit.\r\nIf a generals re-draw is then used no saves are allowed, otherwise a save can be made"]
["A","Aquatic",5,0,0,0,"Troops with this characteristic can treat impassible water features as rough terrain. They also treat marsh and water \nfeatures as cover"]
["B","Black Powder",10,0,0,0,"Shooting hits made by troops with Black Powder characteristic have a +1 to Save modifier. This can stack with other modifiers"]
["B","Breath Weapon",15,0,0,0,"Monstrous Creatures with this characteristic can shoot into their front facing box. No ammunition is tracked, or expended. They are limited to 1 breath weapon attack per turn. \r\nBreath Weapons hit on a 6+, with a negative modifier to the enemy save equal to the Monstrous Creatures level."]
{"$rows_left_out":62}
{"sheet":"General Characteristics_old","index":12,"n_rows":10,"n_cols":7,"rows_kept":10,"cut":false,"hidden":true,"merged":[]}
["Group","Characterics","Cost","Save","VP","VM","Effect"]
[null,"-",0,0,0,0,"-"]
[{"$f":"LEFT(B3,1)","v":"E"},"Enchantress",30,0,2,0,"The Enchantress draws 2 cards when casting a spell, discarding the lowest. She also adds 2 VP to the army"]
[{"$f":"LEFT(B4,1)","v":"D"},"Daemonic",5,0,0,0,"Wizards with the Daemonic characteristic do not add their level to a miscast result. For miscast results of 3 PIP or less, they are still destroyed, but a Spawn of Chaos Spawn is placed in the Wizard's box (if there is space). The Spawn of Chaos is in the same command . The Spawn of Chaos inherits any activation and effect tokens from the Wizard. If no Spawn of Chaos model is available, or the unit cannot fit in the box, the Wizard is simply destroyed."]
["R","Rune Priest",80,0,0,0,"Picking this trait means you cast no Magic. However they can field a Rune Priest (counting as a Level 2 Wizard). A Rune Priest cannot cast any spells but is skilled at unbinding enemy magic. When a Rune Priest attempts to dispel they can discard the lowest card rather than the highest"]
["C","College of Magic",15,0,0,0,"Wizards casting a spell add +1 to their casting draw for each other Wizard, with the College of Magic\ncharacteristic, in the army. The maximum this can be modified by is equal to the casting Wizards level."]
["M","Master of Magic",30,-1,3,0,"A Wizard with this characteristic have the following - \n- Draws a single card when dispelling \n- All friendly wizards within 3 boxes add 1 to the casting draw total, including the Master of Magic himself\n- +1 to Save "]
[""]
[""]
[""]
{"$rows_left_out":1}
{"sheet":"Spells_old","index":13,"n_rows":6,"n_cols":3,"rows_kept":6,"cut":false,"hidden":true,"merged":[]}
["Spell","Casting Value ","Effect "]
["-","-","-"]
["Sorcerous Blast ","7+","Using line of sight, as if shooting, target a unit within 3 boxes of the casting Wizard. Successfully casting the spell does one automatic hit. On an 11+ an extra hit is inflicted per PIP over 10 - up to the level of the caster. Saves can be made as normal."]
["Magma Pool","6+","When cast successfully place a 2 Magma Pool tokens into one or more contigious boxes within 2 of the Wizard.\nThese boxes must be vacant of all troops and terrain. A box can contain more than 1 token.\nAt the beginning of the casting Wizard remove 1 Magma Pool token from each box containing them.\nMagma Pool token - Box is impassible terrain"]
["Sorcerer's Curse","8+","Target enemy unit in adjacent box to the Wizard takes 1 hit. This hit cannot be saved.\nIf a 10-PIP card is drawn for casting the Wizard also takes a hit - this hit can be saved."]
["Doomroar","6+","When cast successfully place a Doomroar token in the Wizards box. Casting this spell ends the Wizard’s activation (but\nnot the command). Doomroar token - Attack (-1). In addition enemy units adjacent have Save (+1) "]

{"sheet":"Traits_old","index":14,"n_rows":21,"n_cols":3,"rows_kept":21,"cut":false,"hidden":true,"merged":[]}
["Trait ","Cost","Effect"]
["-",0,"-"]
["All is Dust",-100,"When a Wizard is slain all  units in and adjacent to the Wizards box take 1 hit, as if from melee. Saves can be made."]
["Ambuscade",50,"Before deployment select up to 3 non-monstrous creature units to be placed into ambush. Attached Generals can be included in this ambush. These units are deployed off-table. Starting from the Player’s 2nd turn you may try to deploy any off-table troops from ambush. Draw an activation card. Attached generals can redraw.\n\n1      The units is lost (counting destroyed), but does not surrender any victory medals\n2-4   The unit is not deployed, remaining off table\n5-8   Deploy the unit in a terrain box (not adjacent to enemy),or out of sight of all enemy \n9-10 Deploy the unit in any terrain box, or out of sight of all enemy"]
["Ancient Race",-70,"The  army must surrender 1 victory medal before the battle begins."]
["Backbone of the Mountain",50,"Before the first piece of terrain is placed the player must choose 1 of the following - \n\n1 - Place 1 box of impassible terrain before any other terrain is placed.\n2 - As the passive army their camps count as fortified (around each face of the box)"]
["City Walls",75,"As the passive army camps can be replaced by City Walls. These count as fortified camps (around the perimeter of boxes). All camps must be placed in contiguous boxes when this option is chosen. Units garrisoning the City walls have no flanks and any attack against the box will count as a frontal attack. If City Walls are chosen then at least 2 camps must be taken in the list\n\nAs the active army place 1 box of impassible terrain directly before the passive army deploys its first command. While this is a terrain piece, for the purposes of enemy troop movement the counts as a unit. This means enemy cannot march while nearby"]
["General Muster",-100,"Each command must have at least two units of a compulsory core troop type."]
["Incursion",50,"This army can choose to field 0 camps "]
["Jungle Runners",75,"No command penalty is applied to any units in the army on account of dense terrain. "]
{"$rows_left_out":11}